{"text_format":"1","workbook":"xlsx","n_sheets":8,"sheets":["Intro","Kalkulačka","Analýza_citlivosti","CMA","Predpoklady","OPEX","Diesel","Ceny_listkov"],"not_rendered":{"charts":1,"images":0,"macros":1,"external_links":0,"defined_names":1,"comments":0,"pivot_tables":0},"unopened":[],"bounds":{"document_bytes":16777216,"sheet_cells":100000,"rows_first":2000,"rows_last":500,"rows_between":2000,"halvings":0,"cell_chars":16384,"cell_head_chars":4096},"cells_cut":0,"cells_raw":0,"read":"whole","date_system":"1900"}

{"sheet":"Intro","index":0,"n_rows":12,"n_cols":1,"rows_kept":12,"cut":false,"hidden":false,"merged":[[11,0,11,6],[6,0,6,6],[7,0,7,6],[8,0,8,6],[9,0,9,6],[10,0,10,6],[0,0,0,6],[1,0,1,6],[2,0,2,6],[3,0,3,6],[4,0,4,6],[5,0,5,6]]}
["Zavedenie školských autobusov v okresoch Senica a Zlaté Moravce a zrušenie malých škôl"]
["Ex- ante hodnotenie politiky"]
["Autori: Martin Haluš, Daniela Zápražná"]
["Riešený problém: Finančne neefektívna alokácia žiakov v malých školách, ktorých možno dopraviť do najbližšej väčšej školy do 25 minút (bez uvažovania s časom potrebným na nástup/výstup žiakov)"]
["Alternatívy riešenia problému:"]
["Z nasledujúcich alternatív boli uvažované: "]
["1.    „Nerobiť nič“"]
["2.    „Preplácané lístky“: využitie súčasnej prímestskej dopravy na prepravu žiakov a preplácanie lístkov "]
["3.    „Prenájom“: outsourcing služby súkromnému prevádzkovateľovi a zavedenie školských autobusov "]
["4.    „Vlastné autobusy“ nákup a prevádzka školských autobusov v rámci okresu "]
{"$rows_left_out":3}
{"sheet":"Kalkulačka","index":1,"n_rows":26,"n_cols":5,"rows_kept":26,"cut":false,"hidden":false,"merged":[[49,3,57,3],[43,3,44,3],[45,3,48,3],[0,0,0,4],[6,0,9,0],[6,3,9,3],[10,0,20,0],[10,3,20,3],[1,4,2,4],[4,4,5,4],[6,4,9,4],[10,4,20,4],[1,3,2,3],[4,0,5,0],[4,3,5,3]]}
["Zlaté Moravce"]
[null,"Diskontná sadzba",0.02,"NPV","Diskontovaná úspora"]
[null,"Indexácia",0.02]
["Nerobiť nič","Ročné náklady na malé školy",{"$f":"VLOOKUP(A1,Predpoklady!A1:J3,10,0)","v":4477465},{"$f":"XNPV($C$2,CMA!C4:V4,CMA!C2:V2)","v":-89539584.015846699},{"$f":"$D$4-D4","v":0}]
["Preplácané lístky","Ročné náklady na lístky",{"$f":"IF(A26=TRUE,VLOOKUP(A1,Predpoklady!$A$1:$I$3,4,0)*C6,VLOOKUP(A1,Predpoklady!$A$1:$I$3,5,0)*C6)","v":31756.294085779158},{"$f":"XNPV($C$2,CMA!C14:V14,CMA!C7:V7)","v":-86731466.160592392},{"$f":"D5-D4","v":2808117.8552543074}]
[null,"Počet školských dní",190]
["Prenájom","Náklad na kilometer",{"$f":"1.3","v":1.3},{"$f":"XNPV($C$2,CMA!C27:V27,CMA!C7:V7)","v":-86770482.136034191},{"$f":"D7-D4","v":2769101.8798125088}]
[null,"Marža",0.05]
[null,"Počet kilometrov vrátane zachádzok",{"$f":"VLOOKUP(A1,Predpoklady!A1:H3,2,0)*(1+C10)*C6","v":24209.8}]
[null,"Zachádzky",0.15]
{"$rows_left_out":17}
{"sheet":"Analýza_citlivosti","index":2,"n_rows":18,"n_cols":14,"rows_kept":18,"cut":false,"hidden":false,"merged":[[1,2,1,3],[1,1,2,1],[8,2,8,3],[8,1,9,1],[8,4,8,5],[1,4,1,5],[1,12,1,13],[8,12,8,13],[1,6,1,7],[1,8,1,9],[1,10,1,11],[8,6,8,7],[8,8,8,9],[8,10,8,11]]}
[]
[null,"BASELINE","Diskont",null,"Inflácia",null,"Cena za km (prenájom)",null,"Zachádzky (prenájom a vlastné autobusy)",null,"CAPEX (vlastné autobusy)",null,"OPEX (vlastné autobusy)"]
[null,null,3.3000000000000002E-2,0.05,0,0.05,1,2,0.05,0.25,1.1000000000000001,0.9,1.1000000000000001,0.6]
["Nerobiť nič",-89539584.015846699,-79596661.219627261,-68930710.002956614,-74669767.565723717,-119579388.63559046,-89539584.015846699,-89539584.015846699,-89539584.015846699,-89539584.015846699,-89539584.015846699,-89539584.015846699,-89539584.015846699,-89539584.015846699]
["Preplácané lístky",-86731466.160592392,-77101959.855762109,-66772216.118136577,-72330369.602488533,-115824369.11380446,-86731466.160592392,-86731466.160592392,-86731466.160592392,-86731466.160592392,-86731466.160592392,-86731466.160592392,-86731466.160592392,-86731466.160592392]
["Prenájom",-86770482.136034191,-77136643.302346408,-66802251.983482845,-72351884.051254839,-115902951.66086753,-86614926.840615541,-87133444.492011011,-86711867.097180784,-86829097.174887568,-86770482.136034191,-86770482.136034191,-86770482.136034191,-86770482.136034191]
["Vlastné busy",-88824011.640717536,-78977849.545961127,-68417684.756615922,-74513447.027906448,-117731413.17376827,-88824011.640717536,-88824011.640717536,-88814813.004550606,-88833210.276884392,-88863311.640717536,-88784711.640717536,-88902603.931884184,-88509642.476050913]
[]
[null,null,"Diskont",null,"Inflácia",null,"Cena za km",null,"Zachádzky (celkovo)",null,"CAPEX (vlastné autobusy)",null,"OPEX (vlastné autobusy)"]
[null,null,{"$f":"C3","v":3.3000000000000002E-2},{"$f":"D3","v":0.05},0,0.05,1,2,0.05,0.25,1.1000000000000001,0.9,1.1000000000000001,0.6]
{"$rows_left_out":9}
{"sheet":"CMA","index":3,"n_rows":50,"n_cols":22,"rows_kept":50,"cut":false,"hidden":false,"merged":[]}
[]
["Nulový scenár",null,"2017-01-01","2018-01-01","2019-01-01","2020-01-01","2021-01-01","2022-01-01","2023-01-01","2024-01-01","2025-01-01","2026-01-01","2027-01-01","2028-01-01","2029-01-01","2030-01-01","2031-01-01","2032-01-01","2033-01-01","2034-01-01","2035-01-01","2036-01-01"]
[]
["Ročné náklady (CF)",null,{"$f":"-Kalkulačka!C4","v":-4477465},{"$f":"C4*(1+Kalkulačka!$C$3)","v":-4567014.3},{"$f":"D4*(1+Kalkulačka!$C$3)","v":-4658354.5860000001},{"$f":"E4*(1+Kalkulačka!$C$3)","v":-4751521.67772},{"$f":"F4*(1+Kalkulačka!$C$3)","v":-4846552.1112743998},{"$f":"G4*(1+Kalkulačka!$C$3)","v":-4943483.1534998883},{"$f":"H4*(1+Kalkulačka!$C$3)","v":-5042352.8165698862},{"$f":"I4*(1+Kalkulačka!$C$3)","v":-5143199.8729012841},{"$f":"J4*(1+Kalkulačka!$C$3)","v":-5246063.8703593099},{"$f":"K4*(1+Kalkulačka!$C$3)","v":-5350985.1477664961},{"$f":"L4*(1+Kalkulačka!$C$3)","v":-5458004.8507218258},{"$f":"M4*(1+Kalkulačka!$C$3)","v":-5567164.9477362623},{"$f":"N4*(1+Kalkulačka!$C$3)","v":-5678508.2466909876},{"$f":"O4*(1+Kalkulačka!$C$3)","v":-5792078.4116248079},{"$f":"P4*(1+Kalkulačka!$C$3)","v":-5907919.9798573041},{"$f":"Q4*(1+Kalkulačka!$C$3)","v":-6026078.3794544507},{"$f":"R4*(1+Kalkulačka!$C$3)","v":-6146599.94704354},{"$f":"S4*(1+Kalkulačka!$C$3)","v":-6269531.9459844111},{"$f":"T4*(1+Kalkulačka!$C$3)","v":-6394922.5849040998},{"$f":"U4*(1+Kalkulačka!$C$3)","v":-6522821.0366021823}]
[{"$f":"XNPV(Kalkulačka!C2,C5:V5,C2:V2)","v":12096344419.737463},null,{"$f":"Predpoklady!L2","v":604882850},{"$f":"C5*(1+Kalkulačka!$C$3)","v":616980507},{"$f":"D5*(1+Kalkulačka!$C$3)","v":629320117.13999999},{"$f":"E5*(1+Kalkulačka!$C$3)","v":641906519.48280001},{"$f":"F5*(1+Kalkulačka!$C$3)","v":654744649.87245607},{"$f":"G5*(1+Kalkulačka!$C$3)","v":667839542.86990523},{"$f":"H5*(1+Kalkulačka!$C$3)","v":681196333.72730339},{"$f":"I5*(1+Kalkulačka!$C$3)","v":694820260.40184951},{"$f":"J5*(1+Kalkulačka!$C$3)","v":708716665.60988653},{"$f":"K5*(1+Kalkulačka!$C$3)","v":722890998.92208421},{"$f":"L5*(1+Kalkulačka!$C$3)","v":737348818.90052593},{"$f":"M5*(1+Kalkulačka!$C$3)","v":752095795.27853644},{"$f":"N5*(1+Kalkulačka!$C$3)","v":767137711.18410718},{"$f":"O5*(1+Kalkulačka!$C$3)","v":782480465.40778935},{"$f":"P5*(1+Kalkulačka!$C$3)","v":798130074.71594512},{"$f":"Q5*(1+Kalkulačka!$C$3)","v":814092676.21026409},{"$f":"R5*(1+Kalkulačka!$C$3)","v":830374529.73446941},{"$f":"S5*(1+Kalkulačka!$C$3)","v":846982020.32915878},{"$f":"T5*(1+Kalkulačka!$C$3)","v":863921660.73574197},{"$f":"U5*(1+Kalkulačka!$C$3)","v":881200093.95045686}]
[{"$f":"A5*0.02/20","v":12096344.419737462}]
["Preplácané lístky",null,"2017-01-01","2018-01-01","2019-01-01","2020-01-01","2021-01-01","2022-01-01","2023-01-01","2024-01-01","2025-01-01","2026-01-01","2027-01-01","2028-01-01","2029-01-01","2030-01-01","2031-01-01","2032-01-01","2033-01-01","2034-01-01","2035-01-01","2036-01-01"]
[]
["Ročné náklady na malé školy",null,{"$f":"C4","v":-4477465},{"$f":"D4","v":-4567014.3},-4658354.5860000001,-4751521.67772,-4846552.1112743998,-4943483.1534998883,-5042352.8165698862,-5143199.8729012841,-5246063.8703593099,-5350985.1477664961,-5458004.8507218258,-5567164.9477362623,-5678508.2466909876,-5792078.4116248079,-5907919.9798573041,-6026078.3794544507,-6146599.94704354,-6269531.9459844111,-6394922.5849040998,-6522821.0366021823]
["Úspora pri zavretí škôl",null,{"$f":"IF(Kalkulačka!A1=\"Senica\",Predpoklady!C3,Predpoklady!C2)","v":172893},{"$f":"C10*(1+Kalkulačka!$C$3)","v":176350.86000000002},{"$f":"D10*(1+Kalkulačka!$C$3)","v":179877.87720000002},{"$f":"E10*(1+Kalkulačka!$C$3)","v":183475.43474400003},{"$f":"F10*(1+Kalkulačka!$C$3)","v":187144.94343888003},{"$f":"G10*(1+Kalkulačka!$C$3)","v":190887.84230765764},{"$f":"H10*(1+Kalkulačka!$C$3)","v":194705.59915381079},{"$f":"I10*(1+Kalkulačka!$C$3)","v":198599.71113688702},{"$f":"J10*(1+Kalkulačka!$C$3)","v":202571.70535962476},{"$f":"K10*(1+Kalkulačka!$C$3)","v":206623.13946681726},{"$f":"L10*(1+Kalkulačka!$C$3)","v":210755.60225615359},{"$f":"M10*(1+Kalkulačka!$C$3)","v":214970.71430127666},{"$f":"N10*(1+Kalkulačka!$C$3)","v":219270.1285873022},{"$f":"O10*(1+Kalkulačka!$C$3)","v":223655.53115904826},{"$f":"P10*(1+Kalkulačka!$C$3)","v":228128.64178222924},{"$f":"Q10*(1+Kalkulačka!$C$3)","v":232691.21461787383},{"$f":"R10*(1+Kalkulačka!$C$3)","v":237345.03891023132},{"$f":"S10*(1+Kalkulačka!$C$3)","v":242091.93968843596},{"$f":"T10*(1+Kalkulačka!$C$3)","v":246933.77848220468},{"$f":"U10*(1+Kalkulačka!$C$3)","v":251872.45405184879}]
{"$rows_left_out":41}
{"sheet":"Predpoklady","index":4,"n_rows":17,"n_cols":15,"rows_kept":17,"cut":false,"hidden":false,"merged":[[7,5,9,5],[1,11,2,11]]}
["Okres","Počet km","Úspora"," Cena lístkov s dotáciou (eur)"," Cena lístkov denne (eur)","CAPEX","Počet vodičov","PZP + Havaríjne","PZP","Celkové náklady na malé školy","Náklady na dovybavenie","Celkové náklady na školy"]
["Zlaté Moravce",{"$f":"Diesel!C13/Kalkulačka!C6","v":110.8},172893,{"$f":"Ceny_listkov!J24*2/1.2","v":167.13838992515346},{"$f":"Ceny_listkov!G24*2/1.2","v":79.500000000000014},{"$f":"B8*D8+B9*D9+B10*D10","v":393000},{"$f":"SUM(B8:B10)","v":5},{"$f":"(I8+K8)*B8+(I9+K9)*B9+(I10+K10)*B10","v":6005.8000000000011},{"$f":"B8*I8+B9*I9+B10*I10","v":2062.5},4477465,{"$f":"90*Ceny_listkov!F36","v":14310},604882850]
["Senica",{"$f":"Diesel!C6/Kalkulačka!C6","v":272},255279,{"$f":"Ceny_listkov!J14*2/1.2","v":263.95251390066693},{"$f":"Ceny_listkov!G14*2/1.2","v":125.55},{"$f":"C8*D8+C9*D9+C10*D10","v":886000},{"$f":"SUM(C8:C10)","v":8},{"$f":"(I8+K8)*C8+(I9+K9)*C9+(I10+K10)*C10","v":12802.89},{"$f":"C8*I8+C9*I9+C10*I10","v":3315},7314756,{"$f":"90*Ceny_listkov!B41","v":23940}]
[]
[]
[]
["Veľkosť autobusu","Zlaté Moravce (počet)","Senica \n(počet)","Jednotková cena bez DPH","Spotreba (l na 100 mk)","Podiel ceny ropy na cene nafty","Model","Počet miest na sedenie","PZP","Havarijné  - bez krádeže","Havaríjne - s krádežou","Kwh","HP","Objem","Váha"]
["Veľký bus",0,2,215000,28,0.6,"Mercedes Benz Tourismo                      ",50,442.5,2331.7399999999998,2590.83,260.2,365,11980]
["Stredný bus",3,3,89000,19,null,"ISUZU Novo Ultra                                  ",25,442.5,965.23,1072.48,140,null,null,9800]
["Malý bus",2,3,63000,10.1,null,"Mercedes Benz Sprinter 519 CDI          ",20,367.5,326.64,362.93,120,163,2143,2268]
{"$rows_left_out":8}
{"sheet":"OPEX","index":5,"n_rows":37,"n_cols":26,"rows_kept":37,"cut":false,"hidden":false,"merged":[[0,0,0,25],[23,0,23,25],[28,0,28,25]]}
["Výdavky na údržbu a opravy ako % z obstarávacej ceny autobusu"]
["Typ","Kapacita","Okres","Počet km za rok",null,null,2017,2018,2019,2020,2021,2022,2023,2024,2025,2026,2027,2028,2029,2030,2031,2032,2033,2034,2035,2036]
[1,"20 osôb","Zlaté Moravce",1672.0000000000002,null,null,0.01,0.01,0.01,{"$f":"I3+0.01","v":0.02},0.03,0.04,0.05,6.0000000000000005E-2,7.0000000000000007E-2,0.08,0.09,9.9999999999999992E-2,0.10999999999999999,0.11999999999999998,0.12999999999999998,0.13999999999999999,0.15,0.16,0.17,0.18000000000000002]
[2,"20 osôb","Senica",3192,null,null,0.02,0.02,0.02,{"$f":"I4+0.01","v":0.03},0.04,0.05,6.0000000000000005E-2,7.0000000000000007E-2,0.08,0.09,9.9999999999999992E-2,0.10999999999999999,0.11999999999999998,0.12999999999999998,0.13999999999999999,0.15,0.16,0.17,0.18000000000000002,0.19000000000000003]
[2,"20 osôb","Senica",5396,null,null,0.02,0.02,0.02,{"$f":"I5+0.01","v":0.03},0.04,0.05,6.0000000000000005E-2,7.0000000000000007E-2,0.08,0.09,9.9999999999999992E-2,0.10999999999999999,0.11999999999999998,0.12999999999999998,0.13999999999999999,0.15,0.16,0.17,0.18000000000000002,0.19000000000000003]
[3,"25 osôb","Zlaté Moravce",3268,null,null,0.02,0.02,0.02,{"$f":"I6+0.01","v":0.03},0.04,0.05,6.0000000000000005E-2,7.0000000000000007E-2,0.08,0.09,9.9999999999999992E-2,0.10999999999999999,0.11999999999999998,0.12999999999999998,0.13999999999999999,0.15,0.16,0.17,0.18000000000000002,0.19000000000000003]
[3,"25 osôb","Senica",4636,null,null,0.02,0.02,0.02,{"$f":"I7+0.01","v":0.03},0.04,0.05,6.0000000000000005E-2,7.0000000000000007E-2,0.08,0.09,9.9999999999999992E-2,0.10999999999999999,0.11999999999999998,0.12999999999999998,0.13999999999999999,0.15,0.16,0.17,0.18000000000000002,0.19000000000000003]
[3,"25 osôb","Senica",6460,null,null,0.02,0.02,0.02,{"$f":"I8+0.01","v":0.03},0.04,0.05,6.0000000000000005E-2,7.0000000000000007E-2,0.08,0.09,9.9999999999999992E-2,0.10999999999999999,0.11999999999999998,0.12999999999999998,0.13999999999999999,0.15,0.16,0.17,0.18000000000000002,0.19000000000000003]
[4,"50 osôb","Zlaté Moravce",3724.0000000000005,null,null,0.02,0.02,0.02,{"$f":"I9+0.015","v":3.5000000000000003E-2},0.05,6.5000000000000002E-2,0.08,9.5000000000000001E-2,0.11,0.125,0.14000000000000001,0.15500000000000003,0.17000000000000004,0.18500000000000005,0.20000000000000007,0.21500000000000008,0.23000000000000009,0.24500000000000011,0.26000000000000012,0.27500000000000013]
[4,"50 osôb","Zlaté Moravce",4408,null,null,0.02,0.02,0.02,{"$f":"I10+0.015","v":3.5000000000000003E-2},0.05,6.5000000000000002E-2,0.08,9.5000000000000001E-2,0.11,0.125,0.14000000000000001,0.15500000000000003,0.17000000000000004,0.18500000000000005,0.20000000000000007,0.21500000000000008,0.23000000000000009,0.24500000000000011,0.26000000000000012,0.27500000000000013]
{"$rows_left_out":28}
{"sheet":"Diesel","index":6,"n_rows":13,"n_cols":26,"rows_kept":13,"cut":false,"hidden":false,"merged":[[0,0,0,25],[7,0,7,25]]}
["Senica"]
["Typ autobusu","Počet km deň","Počet km","Prepočítaný počet km","Spotreba",null,2017,2018,2019,2020,2021,2022,2023,2024,2025,2026,2027,2028,2029,2030,2031,2032,2033,2034,2035,2036]
[20,45.2,{"$f":"B3*Kalkulačka!$C$6","v":8588},{"$f":"C3*(1+Kalkulačka!$C$10)","v":9876.1999999999989},{"$f":"Predpoklady!E10","v":10.1},null,{"$f":"$D3*$E3/100*Kalkulačka!$C$18*(1+Kalkulačka!$C$3*(1-Predpoklady!F8))","v":966.26259898559977},{"$f":"G3*(1+Kalkulačka!$C$3*(1-Predpoklady!$F$8))","v":973.99269977748452},{"$f":"H3*(1+Kalkulačka!$C$3*(1-Predpoklady!$F$8))","v":981.78464137570438},{"$f":"I3*(1+Kalkulačka!$C$3*(1-Predpoklady!$F$8))","v":989.63891850671007},{"$f":"J3*(1+Kalkulačka!$C$3*(1-Predpoklady!$F$8))","v":997.55602985476378},{"$f":"K3*(1+Kalkulačka!$C$3*(1-Predpoklady!$F$8))","v":1005.5364780936019},{"$f":"L3*(1+Kalkulačka!$C$3*(1-Predpoklady!$F$8))","v":1013.5807699183507},{"$f":"M3*(1+Kalkulačka!$C$3*(1-Predpoklady!$F$8))","v":1021.6894160776975},{"$f":"N3*(1+Kalkulačka!$C$3*(1-Predpoklady!$F$8))","v":1029.8629314063191},{"$f":"O3*(1+Kalkulačka!$C$3*(1-Predpoklady!$F$8))","v":1038.1018348575697},{"$f":"P3*(1+Kalkulačka!$C$3*(1-Predpoklady!$F$8))","v":1046.4066495364302},{"$f":"Q3*(1+Kalkulačka!$C$3*(1-Predpoklady!$F$8))","v":1054.7779027327217},{"$f":"R3*(1+Kalkulačka!$C$3*(1-Predpoklady!$F$8))","v":1063.2161259545835},{"$f":"S3*(1+Kalkulačka!$C$3*(1-Predpoklady!$F$8))","v":1071.7218549622203},{"$f":"T3*(1+Kalkulačka!$C$3*(1-Predpoklady!$F$8))","v":1080.295629801918},{"$f":"U3*(1+Kalkulačka!$C$3*(1-Predpoklady!$F$8))","v":1088.9379948403334},{"$f":"V3*(1+Kalkulačka!$C$3*(1-Predpoklady!$F$8))","v":1097.6494987990561},{"$f":"W3*(1+Kalkulačka!$C$3*(1-Predpoklady!$F$8))","v":1106.4306947894486},{"$f":"X3*(1+Kalkulačka!$C$3*(1-Predpoklady!$F$8))","v":1115.2821403477642},{"$f":"Y3*(1+Kalkulačka!$C$3*(1-Predpoklady!$F$8))","v":1124.2043974705464}]
[25,58.4,{"$f":"B4*Kalkulačka!$C$6","v":11096},{"$f":"C4*(1+Kalkulačka!$C$10)","v":12760.4},{"$f":"Predpoklady!E9","v":19},null,{"$f":"$D4*$E4/100*Kalkulačka!$C$18*(1+Kalkulačka!$C$3*(1-Predpoklady!F8))","v":2348.5608074880001},{"$f":"G4*(1+Kalkulačka!$C$3*(1-Predpoklady!$F$8))","v":2367.3492939479042},{"$f":"H4*(1+Kalkulačka!$C$3*(1-Predpoklady!$F$8))","v":2386.2880882994873},{"$f":"I4*(1+Kalkulačka!$C$3*(1-Predpoklady!$F$8))","v":2405.378393005883},{"$f":"J4*(1+Kalkulačka!$C$3*(1-Predpoklady!$F$8))","v":2424.6214201499301},{"$f":"K4*(1+Kalkulačka!$C$3*(1-Predpoklady!$F$8))","v":2444.0183915111297},{"$f":"L4*(1+Kalkulačka!$C$3*(1-Predpoklady!$F$8))","v":2463.5705386432187},{"$f":"M4*(1+Kalkulačka!$C$3*(1-Predpoklady!$F$8))","v":2483.2791029523646},{"$f":"N4*(1+Kalkulačka!$C$3*(1-Predpoklady!$F$8))","v":2503.1453357759838},{"$f":"O4*(1+Kalkulačka!$C$3*(1-Predpoklady!$F$8))","v":2523.1704984621915},{"$f":"P4*(1+Kalkulačka!$C$3*(1-Predpoklady!$F$8))","v":2543.3558624498892},{"$f":"Q4*(1+Kalkulačka!$C$3*(1-Predpoklady!$F$8))","v":2563.7027093494885},{"$f":"R4*(1+Kalkulačka!$C$3*(1-Predpoklady!$F$8))","v":2584.2123310242846},{"$f":"S4*(1+Kalkulačka!$C$3*(1-Predpoklady!$F$8))","v":2604.8860296724788},{"$f":"T4*(1+Kalkulačka!$C$3*(1-Predpoklady!$F$8))","v":2625.7251179098585},{"$f":"U4*(1+Kalkulačka!$C$3*(1-Predpoklady!$F$8))","v":2646.7309188531372},{"$f":"V4*(1+Kalkulačka!$C$3*(1-Predpoklady!$F$8))","v":2667.9047662039625},{"$f":"W4*(1+Kalkulačka!$C$3*(1-Predpoklady!$F$8))","v":2689.2480043335941},{"$f":"X4*(1+Kalkulačka!$C$3*(1-Predpoklady!$F$8))","v":2710.7619883682628},{"$f":"Y4*(1+Kalkulačka!$C$3*(1-Predpoklady!$F$8))","v":2732.4480842752091}]
[50,168.4,{"$f":"B5*Kalkulačka!$C$6","v":31996},{"$f":"C5*(1+Kalkulačka!$C$10)","v":36795.399999999994},{"$f":"Predpoklady!E8","v":28},null,{"$f":"$D5*$E5/100*Kalkulačka!$C$18*(1+Kalkulačka!$C$3*(1-Predpoklady!F8))","v":9980.1134818559967},{"$f":"G5*(1+Kalkulačka!$C$3*(1-Predpoklady!$F$8))","v":10059.954389710845},{"$f":"H5*(1+Kalkulačka!$C$3*(1-Predpoklady!$F$8))","v":10140.434024828532},{"$f":"I5*(1+Kalkulačka!$C$3*(1-Predpoklady!$F$8))","v":10221.557497027159},{"$f":"J5*(1+Kalkulačka!$C$3*(1-Predpoklady!$F$8))","v":10303.329957003376},{"$f":"K5*(1+Kalkulačka!$C$3*(1-Predpoklady!$F$8))","v":10385.756596659403},{"$f":"L5*(1+Kalkulačka!$C$3*(1-Predpoklady!$F$8))","v":10468.842649432678},{"$f":"M5*(1+Kalkulačka!$C$3*(1-Predpoklady!$F$8))","v":10552.593390628139},{"$f":"N5*(1+Kalkulačka!$C$3*(1-Predpoklady!$F$8))","v":10637.014137753164},{"$f":"O5*(1+Kalkulačka!$C$3*(1-Predpoklady!$F$8))","v":10722.110250855188},{"$f":"P5*(1+Kalkulačka!$C$3*(1-Predpoklady!$F$8))","v":10807.88713286203},{"$f":"Q5*(1+Kalkulačka!$C$3*(1-Predpoklady!$F$8))","v":10894.350229924927},{"$f":"R5*(1+Kalkulačka!$C$3*(1-Predpoklady!$F$8))","v":10981.505031764325},{"$f":"S5*(1+Kalkulačka!$C$3*(1-Predpoklady!$F$8))","v":11069.35707201844},{"$f":"T5*(1+Kalkulačka!$C$3*(1-Predpoklady!$F$8))","v":11157.911928594587},{"$f":"U5*(1+Kalkulačka!$C$3*(1-Predpoklady!$F$8))","v":11247.175224023344},{"$f":"V5*(1+Kalkulačka!$C$3*(1-Predpoklady!$F$8))","v":11337.15262581553},{"$f":"W5*(1+Kalkulačka!$C$3*(1-Predpoklady!$F$8))","v":11427.849846822055},{"$f":"X5*(1+Kalkulačka!$C$3*(1-Predpoklady!$F$8))","v":11519.272645596631},{"$f":"Y5*(1+Kalkulačka!$C$3*(1-Predpoklady!$F$8))","v":11611.426826761404}]
[null,{"$f":"SUM(B3:B5)","v":272},{"$f":"SUM(C3:C5)","v":51680},{"$f":"SUM(D3:D5)","v":59431.999999999993},null,null,{"$f":"SUM(G3:G5)","v":13294.936888329597},{"$f":"SUM(H3:H5)","v":13401.296383436234},13508.506754503724,13616.574808539752,13725.50740700807,13835.311466264135,13945.993957994247,14057.561909658201,14170.022404935466,14283.382584174949,14397.649644848349,14512.830842007137,{"$f":"SUM(S3:S5)","v":14628.933488743194},14745.964956653139,14863.932676306364,14982.844137716815,15102.706890818548,15223.528545945097,15345.316774312658,15468.07930850716]
[]
["Zlaté Moravce "]
["Typ autobusu","Počet km deň","Počet km","Prepočítaný počet km","Spotreba",null,2017,2018,2019,2020,2021,2022,2023,2024,2025,2026,2027,2028,2029,2030,2031,2032,2033,2034,2035,2036]
[20,8.8000000000000007,{"$f":"B10*Kalkulačka!$C$6","v":1672.0000000000002},{"$f":"C10*(1+Kalkulačka!$C$10)","v":1922.8000000000002},{"$f":"Predpoklady!E10","v":10.1},null,{"$f":"$D10*$E10/100*Kalkulačka!$C$18*(1+Kalkulačka!$C$3*(1-Predpoklady!F8))","v":188.12192192640003},{"$f":"G10*(1+Kalkulačka!$C$3*(1-Predpoklady!$F$8))","v":189.62689730181123},{"$f":"H10*(1+Kalkulačka!$C$3*(1-Predpoklady!$F$8))","v":191.14391248022571},{"$f":"I10*(1+Kalkulačka!$C$3*(1-Predpoklady!$F$8))","v":192.67306378006751},{"$f":"J10*(1+Kalkulačka!$C$3*(1-Predpoklady!$F$8))","v":194.21444829030804},{"$f":"K10*(1+Kalkulačka!$C$3*(1-Predpoklady!$F$8))","v":195.7681638766305},{"$f":"L10*(1+Kalkulačka!$C$3*(1-Predpoklady!$F$8))","v":197.33430918764356},{"$f":"M10*(1+Kalkulačka!$C$3*(1-Predpoklady!$F$8))","v":198.91298366114469},{"$f":"N10*(1+Kalkulačka!$C$3*(1-Predpoklady!$F$8))","v":200.50428753043386},{"$f":"O10*(1+Kalkulačka!$C$3*(1-Predpoklady!$F$8))","v":202.10832183067734},{"$f":"P10*(1+Kalkulačka!$C$3*(1-Predpoklady!$F$8))","v":203.72518840532277},{"$f":"Q10*(1+Kalkulačka!$C$3*(1-Predpoklady!$F$8))","v":205.35498991256534},{"$f":"R10*(1+Kalkulačka!$C$3*(1-Predpoklady!$F$8))","v":206.99782983186586},{"$f":"S10*(1+Kalkulačka!$C$3*(1-Predpoklady!$F$8))","v":208.65381247052079},{"$f":"T10*(1+Kalkulačka!$C$3*(1-Predpoklady!$F$8))","v":210.32304297028494},{"$f":"U10*(1+Kalkulačka!$C$3*(1-Predpoklady!$F$8))","v":212.00562731404722},{"$f":"V10*(1+Kalkulačka!$C$3*(1-Predpoklady!$F$8))","v":213.70167233255961},{"$f":"W10*(1+Kalkulačka!$C$3*(1-Predpoklady!$F$8))","v":215.4112857112201},{"$f":"X10*(1+Kalkulačka!$C$3*(1-Predpoklady!$F$8))","v":217.13457599690986},{"$f":"Y10*(1+Kalkulačka!$C$3*(1-Predpoklady!$F$8))","v":218.87165260488513}]
{"$rows_left_out":4}
{"sheet":"Ceny_listkov","index":7,"n_rows":41,"n_cols":13,"rows_kept":41,"cut":false,"hidden":false,"merged":[[36,2,37,2],[38,2,39,2],[26,4,26,6],[26,0,26,2],[28,6,30,6],[28,2,29,2],[30,2,31,2]]}
["Od","Kam","km","Cena v hotovosti","Cena z čipovej karty","Počet detí",null,null,null,"Zohľadnenie dotácie pre deti ktore pojdu novymi busmi (nad 20)"]
["Kuklov","Šaštín-Stráže",6,0.4,0.25,23,{"$f":"F2*E2","v":5.75},{"$f":"F2*D2","v":9.2000000000000011},null,{"$f":"IF(F2<0,E2*F2,K2)","v":12.08862568641047},{"$f":"G2*Predpoklady!$B$17","v":12.08862568641047}]
["Smolinské","Šaštín-Stráže",4,0.35,0.22,33,{"$f":"F3*E3","v":7.26},{"$f":"F3*D3","v":11.549999999999999},null,{"$f":"IF(F3<0,E3*F3,K3)","v":15.263203910146089},{"$f":"G3*Predpoklady!$B$17","v":15.263203910146089}]
["Koválov","Dojč",5,0.4,0.25,22,5.5,8.8000000000000007,null,11.563033265262188,{"$f":"G4*Predpoklady!$B$17","v":11.563033265262188}]
["Šajdíkove Humence","Dojč",5,0.4,0.25,30,7.5,12,"malo spojeni",15.767772634448439,{"$f":"G5*Predpoklady!$B$17","v":15.767772634448439}]
["Smrdáky","Senica",7,0.4,0.25,22,5.5,8.8000000000000007,null,11.563033265262188,{"$f":"G6*Predpoklady!$B$17","v":11.563033265262188}]
["Častkov","Sobotište","10+9",0.9,0.66,23,15.180000000000001,20.7,"prestup v Senici",31.913971812123645,{"$f":"G7*Predpoklady!$B$17","v":31.913971812123645}]
["Prietrž","Senica",7,0.4,0.25,13,3.25,5.2,null,6.8327014749276573,{"$f":"G8*Predpoklady!$B$17","v":6.8327014749276573}]
["Hlboké","Senica",5,0.4,0.25,13,3.25,5.2,null,6.8327014749276573,{"$f":"G9*Predpoklady!$B$17","v":6.8327014749276573}]
["Hradište pod Vrátnom","Jablonica",5,0.4,0.25,10,2.5,4,null,5.2559242114828129,{"$f":"G10*Predpoklady!$B$17","v":5.2559242114828129}]
{"$rows_left_out":31}